Target
DNA dC->dU-editing enzyme APOBEC-3G
Ligand
BDBM1017
Substrate
Meas. Tech.
SAR analysis of small molecule inhibitors of APOBEC3G DNA Deaminase via a fluorescence-based single-stranded DNA deaminase assay
Temperature
298.15±n/a K
IC50
>99000±n/a nM
Comments
extracted
Citation
 PubChem, PC SAR analysis of small molecule inhibitors of APOBEC3G DNA Deaminase via a fluorescence-based single-stranded DNA deaminase assay PubChem Bioassay (2011)[AID] 
Target
Name:
DNA dC->dU-editing enzyme APOBEC-3G
Synonyms:
ABC3G_HUMAN | APOBEC3G
Type:
Enzyme Catalytic Domain
Mol. Mass.:
46419.54
Organism:
Homo sapiens (Human)
Description:
gi_13399304
Residue:
384
  
Inhibitor
Name:
BDBM1017
Synonyms:
cid_34613903
Type:
Emp. Form.:
C17H15N3O4
Mol. Mass.:
325.3187
SMILES:
Cc1ccc(N2C(=O)N(CC(=O)c3ccc[nH]3)C(=O)C2=O)c(C)c1
: