Target
DNA dC->dU-editing enzyme APOBEC-3G
Ligand
BDBM87088
Substrate
Meas. Tech.
SAR analysis of small molecule inhibitors of APOBEC3G DNA Deaminase via a fluorescence-based single-stranded DNA deaminase assay
Temperature
298.15±n/a K
IC50
>99000±n/a nM
Comments
extracted
Citation
 PubChem, PC SAR analysis of small molecule inhibitors of APOBEC3G DNA Deaminase via a fluorescence-based single-stranded DNA deaminase assay PubChem Bioassay (2011)[AID] 
Target
Name:
DNA dC->dU-editing enzyme APOBEC-3G
Synonyms:
ABC3G_HUMAN | APOBEC3G
Type:
Enzyme Catalytic Domain
Mol. Mass.:
46419.54
Organism:
Homo sapiens (Human)
Description:
gi_13399304
Residue:
384
  
Inhibitor
Name:
BDBM87088
Synonyms:
2-(4-methylphenyl)-N-(5-pyridin-4-yl-1,3,4-thiadiazol-2-yl)acetamide 2-(p-tolyl)-N-[5-(4-pyridyl)-1,3,4-thiadiazol-2-yl]acetamide cid_6464896
Type:
Small organic molecule
Emp. Form.:
C16H14N4OS
Mol. Mass.:
310.374
SMILES:
Cc1ccc(CC(=O)Nc2nnc(s2)-c2ccncc2)cc1
: