Target
DNA dC->dU-editing enzyme APOBEC-3G
Ligand
BDBM66135
Substrate
Meas. Tech.
SAR analysis of small molecule inhibitors of APOBEC3G DNA Deaminase via a fluorescence-based single-stranded DNA deaminase assay
Temperature
298.15±n/a K
IC50
>99000±n/a nM
Comments
extracted
Citation
 PubChem, PC SAR analysis of small molecule inhibitors of APOBEC3G DNA Deaminase via a fluorescence-based single-stranded DNA deaminase assay PubChem Bioassay (2011)[AID] 
Target
Name:
DNA dC->dU-editing enzyme APOBEC-3G
Synonyms:
ABC3G_HUMAN | APOBEC3G
Type:
Enzyme Catalytic Domain
Mol. Mass.:
46419.54
Organism:
Homo sapiens (Human)
Description:
gi_13399304
Residue:
384
  
Inhibitor
Name:
BDBM66135
Synonyms:
5-methyl-3-[(E)-2-(1-methyl-4-pyridin-1-iumyl)ethenyl]-1H-indole;iodide 5-methyl-3-[(E)-2-(1-methylpyridin-1-ium-4-yl)vinyl]-1H-indole;iodide SMR000544817 | cid_24761146
Type:
Small organic molecule
Emp. Form.:
C17H17N2
Mol. Mass.:
249.3297
SMILES:
Cc1ccc2[nH]cc(\C=C\c3cc[n+](C)cc3)c2c1
: