Target
DNA dC->dU-editing enzyme APOBEC-3G
Ligand
BDBM40590
Substrate
Meas. Tech.
SAR analysis of small molecule inhibitors of APOBEC3G DNA Deaminase via a fluorescence-based single-stranded DNA deaminase assay
Temperature
298.15±n/a K
IC50
39300±n/a nM
Comments
extracted
Citation
 PubChem, PC SAR analysis of small molecule inhibitors of APOBEC3G DNA Deaminase via a fluorescence-based single-stranded DNA deaminase assay PubChem Bioassay (2011)[AID] 
Target
Name:
DNA dC->dU-editing enzyme APOBEC-3G
Synonyms:
ABC3G_HUMAN | APOBEC3G
Type:
Enzyme Catalytic Domain
Mol. Mass.:
46419.54
Organism:
Homo sapiens (Human)
Description:
gi_13399304
Residue:
384
  
Inhibitor
Name:
BDBM40590
Synonyms:
4-[(2,5-dimethyl-1-pyrrolyl)methyl]benzoic acid MLS000071163 cid_659752
Type:
Small organic molecule
Emp. Form.:
C14H15NO2
Mol. Mass.:
229.2744
SMILES:
Cc1ccc(C)n1Cc1ccc(cc1)C(O)=O
: