Target
Phospholipase D2
Ligand
BDBM87169
Substrate
Meas. Tech.
Cellular PLD2 concentration response
IC50
8000±n/a nM
Citation
 PubChem, PC Cellular PLD2 concentration response PubChem Bioassay (2011)[AID] 
Target
Name:
Phospholipase D2
Synonyms:
PLD2 Phospholipase D2 phospholipase D2 isoform PLD2A
Type:
Protein
Mol. Mass.:
106002.47
Organism:
Homo sapiens (Human)
Description:
Residue:
933
  
Inhibitor
Name:
BDBM87169
Synonyms:
CHEMBL1254175 N-[2-[1-(4-bromophenyl)-4-oxidanylidene-1,3,8-triazaspiro[4.5]decan-8-yl]ethyl]-4-fluoranyl-benzamide;2,2,2-tris(fluoranyl)ethanoic acid VU0402727-1 | cid_46938429
Type:
Small organic molecule
Emp. Form.:
C22H24BrFN4O2
Mol. Mass.:
475.354
SMILES:
Fc1ccc(cc1)C(=O)NCCN1CCC2(CC1)N(CNC2=O)c1ccc(Br)cc1
: