Target
Phospholipase D2
Ligand
BDBM87188
Substrate
Meas. Tech.
Cellular PLD2 concentration response
IC50
30±n/a nM
Citation
 PubChem, PC Cellular PLD2 concentration response PubChem Bioassay (2011)[AID] 
Target
Name:
Phospholipase D2
Synonyms:
PLD2 Phospholipase D2 phospholipase D2 isoform PLD2A
Type:
Protein
Mol. Mass.:
106002.47
Organism:
Homo sapiens (Human)
Description:
Residue:
933
  
Inhibitor
Name:
BDBM87188
Synonyms:
CHEMBL471257 N-[2-(4-oxidanylidene-1-phenyl-1,3,8-triazaspiro[4.5]decan-8-yl)ethyl]-1-benzothiophene-2-carboxamide;2,2,2-tris(fluoranyl)ethanoic acid VU0364196-1 | cid_53470134
Type:
Small organic molecule
Emp. Form.:
C24H26N4O2S
Mol. Mass.:
434.554
SMILES:
O=C(NCCN1CCC2(CC1)N(CNC2=O)c1ccccc1)c1cc2ccccc2s1
: