Target
Phospholipase D2
Ligand
BDBM87198
Substrate
Meas. Tech.
Cellular PLD2 concentration response
IC50
14490±n/a nM
Citation
 PubChem, PC Cellular PLD2 concentration response PubChem Bioassay (2011)[AID] 
Target
Name:
Phospholipase D2
Synonyms:
PLD2 Phospholipase D2 phospholipase D2 isoform PLD2A
Type:
Protein
Mol. Mass.:
106002.47
Organism:
Homo sapiens (Human)
Description:
Residue:
933
  
Inhibitor
Name:
BDBM87198
Synonyms:
(2R)-N-[(1S)-2-[4-(2-keto-3H-benzimidazol-1-yl)piperidino]-1-methyl-ethyl]-2-phenyl-cyclopropanecarboxamide;2,2,2-trifluoroacetic acid (2R)-N-[(2S)-1-[4-(2-oxo-3H-benzimidazol-1-yl)-1-piperidinyl]propan-2-yl]-2-phenyl-1-cyclopropanecarboxamide;2,2,2-trifluoroacetic acid VU0360244-1 | cid_53470157
Type:
Small organic molecule
Emp. Form.:
C25H30N4O2
Mol. Mass.:
418.5313
SMILES:
C[C@@H](CN1CCC(CC1)n1c2ccccc2[nH]c1=O)NC(=O)C1C[C@H]1c1ccccc1
: