Target
Phospholipase D2
Ligand
BDBM87225
Substrate
Meas. Tech.
Cellular PLD2 concentration response
IC50
434±n/a nM
Citation
 PubChem, PC Cellular PLD2 concentration response PubChem Bioassay (2011)[AID] 
Target
Name:
Phospholipase D2
Synonyms:
PLD2 Phospholipase D2 phospholipase D2 isoform PLD2A
Type:
Protein
Mol. Mass.:
106002.47
Organism:
Homo sapiens (Human)
Description:
Residue:
933
  
Inhibitor
Name:
BDBM87225
Synonyms:
4-chloranyl-N-[(2S)-1-[4-(6-fluoranyl-2-oxidanylidene-3H-benzimidazol-1-yl)piperidin-1-yl]propan-2-yl]benzamide;2,2,2-tris(fluoranyl)ethanoic acid 4-chloro-N-[(2S)-1-[4-(6-fluoro-2-oxo-3H-benzimidazol-1-yl)-1-piperidinyl]propan-2-yl]benzamide;2,2,2-trifluoroacetic acid VU0359566-1 | cid_53470205
Type:
Small organic molecule
Emp. Form.:
C22H24ClFN4O2
Mol. Mass.:
430.903
SMILES:
C[C@@H](CN1CCC(CC1)n1c2cc(F)ccc2[nH]c1=O)NC(=O)c1ccc(Cl)cc1
: