Target
Phospholipase D2
Ligand
BDBM87235
Substrate
Meas. Tech.
Cellular PLD2 concentration response
IC50
18000±n/a nM
Citation
 PubChem, PC Cellular PLD2 concentration response PubChem Bioassay (2011)[AID] 
Target
Name:
Phospholipase D2
Synonyms:
PLD2 Phospholipase D2 phospholipase D2 isoform PLD2A
Type:
Protein
Mol. Mass.:
106002.47
Organism:
Homo sapiens (Human)
Description:
Residue:
933
  
Inhibitor
Name:
BDBM87235
Synonyms:
N-[2-[4-(3-methoxyphenyl)-1-piperazinyl]ethyl]-2-naphthalenecarboxamide N-[2-[4-(3-methoxyphenyl)piperazino]ethyl]-2-naphthamide cid_53470286
Type:
Small organic molecule
Emp. Form.:
C24H27N3O2
Mol. Mass.:
389.4901
SMILES:
COc1cccc(c1)N1CCN(CCNC(=O)c2ccc3ccccc3c2)CC1
: