Target
Phospholipase D2
Ligand
BDBM87246
Substrate
Meas. Tech.
Cellular PLD2 concentration response
IC50
2250±n/a nM
Citation
 PubChem, PC Cellular PLD2 concentration response PubChem Bioassay (2011)[AID] 
Target
Name:
Phospholipase D2
Synonyms:
PLD2 Phospholipase D2 phospholipase D2 isoform PLD2A
Type:
Protein
Mol. Mass.:
106002.47
Organism:
Homo sapiens (Human)
Description:
Residue:
933
  
Inhibitor
Name:
BDBM87246
Synonyms:
N-[(1S)-2-[4-(2-keto-3H-benzimidazol-1-yl)-3,6-dihydro-2H-pyridin-1-yl]-1-methyl-ethyl]-2-naphthamide N-[(2S)-1-[4-(2-oxo-3H-benzimidazol-1-yl)-3,6-dihydro-2H-pyridin-1-yl]propan-2-yl]-2-naphthalenecarboxamide VU0453721-1 | cid_53482015
Type:
Small organic molecule
Emp. Form.:
C26H26N4O2
Mol. Mass.:
426.5102
SMILES:
C[C@@H](CN1CCC(=CC1)n1c2ccccc2[nH]c1=O)NC(=O)c1ccc2ccccc2c1
: