Target
Phospholipase D2
Ligand
BDBM87185
Substrate
Meas. Tech.
PLD2 purified enzyme concentration response
IC50
170±n/a nM
Citation
 PubChem, PC PLD2 purified enzyme concentration response PubChem Bioassay (2011)[AID] 
Target
Name:
Phospholipase D2
Synonyms:
PLD2 Phospholipase D2 phospholipase D2 isoform PLD2A
Type:
Protein
Mol. Mass.:
106002.47
Organism:
Homo sapiens (Human)
Description:
Residue:
933
  
Inhibitor
Name:
BDBM87185
Synonyms:
4-amino-3-methoxy-N-[2-(4-oxo-1-phenyl-1,3,8-triazaspiro[4.5]decan-8-yl)ethyl]benzamide;2,2,2-trifluoroacetic acid 4-azanyl-3-methoxy-N-[2-(4-oxidanylidene-1-phenyl-1,3,8-triazaspiro[4.5]decan-8-yl)ethyl]benzamide;2,2,2-tris(fluoranyl)ethanoic acid VU0364185-1 | cid_53470115
Type:
Small organic molecule
Emp. Form.:
C23H29N5O3
Mol. Mass.:
423.5081
SMILES:
COc1cc(ccc1N)C(=O)NCCN1CCC2(CC1)N(CNC2=O)c1ccccc1
: