Target
Phospholipase D1
Ligand
BDBM87215
Substrate
Meas. Tech.
PLD1 purified enzyme concentration response
IC50
42±n/a nM
Citation
 PubChem, PC PLD1 purified enzyme concentration response PubChem Bioassay (2011)[AID] 
Target
Name:
Phospholipase D1
Synonyms:
Choline phosphatase 1 PLD1 Phosphatidylcholine-hydrolyzing phospholipase D1 Phospholipase D1 Phospholipase D2 (PLD2) | hPLD1
Type:
Protein
Mol. Mass.:
124219.92
Organism:
Homo sapiens (Human)
Description:
Q13393
Residue:
1074
  
Inhibitor
Name:
BDBM87215
Synonyms:
N-[(1S)-2-[4-(5-bromo-2-keto-3H-benzimidazol-1-yl)piperidino]-1-methyl-ethyl]-2-naphthamide;2,2,2-trifluoroacetic acid N-[(2S)-1-[4-(5-bromo-2-oxo-3H-benzimidazol-1-yl)-1-piperidinyl]propan-2-yl]-2-naphthalenecarboxamide;2,2,2-trifluoroacetic acid VU0359594-1 | cid_53470192
Type:
Small organic molecule
Emp. Form.:
C26H27BrN4O2
Mol. Mass.:
507.422
SMILES:
C[C@@H](CN1CCC(CC1)n1c2ccc(Br)cc2[nH]c1=O)NC(=O)c1ccc2ccccc2c1
: