Target
Phospholipase D1
Ligand
BDBM87173
Substrate
Meas. Tech.
Cellular PLD1 concentration response
IC50
33±n/a nM
Citation
 PubChem, PC Cellular PLD1 concentration response PubChem Bioassay (2011)[AID] 
Target
Name:
Phospholipase D1
Synonyms:
Choline phosphatase 1 PLD1 Phosphatidylcholine-hydrolyzing phospholipase D1 Phospholipase D1 Phospholipase D2 (PLD2) | hPLD1
Type:
Protein
Mol. Mass.:
124219.92
Organism:
Homo sapiens (Human)
Description:
Q13393
Residue:
1074
  
Inhibitor
Name:
BDBM87173
Synonyms:
N-[2-[4-(2-keto-3H-benzimidazol-1-yl)piperidino]ethyl]thiazole-4-carboxamide;2,2,2-trifluoroacetic acid N-[2-[4-(2-oxo-3H-benzimidazol-1-yl)-1-piperidinyl]ethyl]-4-thiazolecarboxamide;2,2,2-trifluoroacetic acid VU0366535-1 | cid_53469992
Type:
Small organic molecule
Emp. Form.:
C18H21N5O2S
Mol. Mass.:
371.457
SMILES:
O=C(NCCN1CCC(CC1)n1c2ccccc2[nH]c1=O)c1cscn1
: