Target
Phospholipase D1
Ligand
BDBM87178
Substrate
Meas. Tech.
Cellular PLD1 concentration response
IC50
17000±n/a nM
Citation
 PubChem, PC Cellular PLD1 concentration response PubChem Bioassay (2011)[AID] 
Target
Name:
Phospholipase D1
Synonyms:
Choline phosphatase 1 PLD1 Phosphatidylcholine-hydrolyzing phospholipase D1 Phospholipase D1 Phospholipase D2 (PLD2) | hPLD1
Type:
Protein
Mol. Mass.:
124219.92
Organism:
Homo sapiens (Human)
Description:
Q13393
Residue:
1074
  
Inhibitor
Name:
BDBM87178
Synonyms:
6-fluoranyl-N-[2-[1-(3-fluorophenyl)-4-oxidanylidene-1,3,8-triazaspiro[4.5]decan-8-yl]ethyl]pyridine-3-carboxamide;2,2,2-tris(fluoranyl)ethanoic acid 6-fluoro-N-[2-[1-(3-fluorophenyl)-4-oxo-1,3,8-triazaspiro[4.5]decan-8-yl]ethyl]-3-pyridinecarboxamide;2,2,2-trifluoroacetic acid VU0366559-1 | cid_53470038
Type:
Small organic molecule
Emp. Form.:
C21H23F2N5O2
Mol. Mass.:
415.4364
SMILES:
Fc1cccc(c1)N1CNC(=O)C11CCN(CCNC(=O)c2ccc(F)nc2)CC1
: