Target
Phospholipase D1
Ligand
BDBM87242
Substrate
Meas. Tech.
Cellular PLD1 concentration response
IC50
16±n/a nM
Citation
 PubChem, PC Cellular PLD1 concentration response PubChem Bioassay (2011)[AID] 
Target
Name:
Phospholipase D1
Synonyms:
Choline phosphatase 1 PLD1 Phosphatidylcholine-hydrolyzing phospholipase D1 Phospholipase D1 Phospholipase D2 (PLD2) | hPLD1
Type:
Protein
Mol. Mass.:
124219.92
Organism:
Homo sapiens (Human)
Description:
Q13393
Residue:
1074
  
Inhibitor
Name:
BDBM87242
Synonyms:
N-[2-[4-(2-keto-3H-benzimidazol-1-yl)piperidino]ethyl]phenanthrene-9-carboxamide N-[2-[4-(2-oxo-3H-benzimidazol-1-yl)-1-piperidinyl]ethyl]-9-phenanthrenecarboxamide VU0221810-1 | cid_53470346
Type:
Small organic molecule
Emp. Form.:
C29H28N4O2
Mol. Mass.:
464.5582
SMILES:
O=C(NCCN1CCC(CC1)n1c2ccccc2[nH]c1=O)c1cc2ccccc2c2ccccc12
: