Target
Nuclear receptor coactivator 3
Ligand
BDBM87263
Substrate
Meas. Tech.
Luminescence-based cell-based high throughput dose response assay for inhibitors of the Steroid Receptor Coactivator 3 (SRC3; NCOA3)
IC50
4340±n/a nM
Citation
 PubChem, PC Luminescence-based cell-based high throughput dose response assay for inhibitors of the Steroid Receptor Coactivator 3 (SRC3; NCOA3) PubChem Bioassay (2012)[AID] 
Target
Name:
Nuclear receptor coactivator 3
Synonyms:
AIB1 NCOA3 RAC3 nuclear receptor coactivator 3 isoform a
Type:
Enzyme Catalytic Domain
Mol. Mass.:
155305.29
Organism:
Homo sapiens (Human)
Description:
Q9Y6Q9
Residue:
1424
  
Inhibitor
Name:
BDBM87263
Synonyms:
2-amino-1-(3,5-dichlorophenyl)-1',7,7-trimethyl-2',5-dioxo-1,1',3',4,5,6,7,8-octahydrospiro[quinoline-4,3'-(2'H)-indole]-3-carbonitrile 2-amino-1-(3,5-dichlorophenyl)-1',7,7-trimethyl-2',5-dioxospiro[6,8-dihydroquinoline-4,3'-indole]-3-carbonitrile 2-azanyl-1-[3,5-bis(chloranyl)phenyl]-1',7,7-trimethyl-2',5-bis(oxidanylidene)spiro[6,8-dihydroquinoline-4,3'-indole]-3-carbonitrile SMR000161610 | cid_5075681
Type:
Small organic molecule
Emp. Form.:
C26H22Cl2N4O2
Mol. Mass.:
493.384
SMILES:
CN1C(=O)C2(C(C#N)C(=N)N(C3=C2C(=O)CC(C)(C)C3)c2cc(Cl)cc(Cl)c2)c2ccccc12
: