Target
Nuclear receptor coactivator 3
Ligand
BDBM68079
Substrate
Meas. Tech.
Luminescence-based cell-based high throughput dose response assay for inhibitors of the Steroid Receptor Coactivator 3 (SRC3; NCOA3)
IC50
10084±n/a nM
Citation
 PubChem, PC Luminescence-based cell-based high throughput dose response assay for inhibitors of the Steroid Receptor Coactivator 3 (SRC3; NCOA3) PubChem Bioassay (2012)[AID] 
Target
Name:
Nuclear receptor coactivator 3
Synonyms:
AIB1 NCOA3 RAC3 nuclear receptor coactivator 3 isoform a
Type:
Enzyme Catalytic Domain
Mol. Mass.:
155305.29
Organism:
Homo sapiens (Human)
Description:
Q9Y6Q9
Residue:
1424
  
Inhibitor
Name:
BDBM68079
Synonyms:
3,5,6-trichloro-1-(4-methylphenyl)-2(1H)-pyrazinone 3,5,6-trichloro-1-(4-methylphenyl)pyrazin-2-one 3,5,6-tris(chloranyl)-1-(4-methylphenyl)pyrazin-2-one SMR000229702 | cid_849396
Type:
Small organic molecule
Emp. Form.:
C11H7Cl3N2O
Mol. Mass.:
289.545
SMILES:
Cc1ccc(cc1)-n1c(Cl)c(Cl)nc(Cl)c1=O
: