Target
Nuclear receptor coactivator 3
Ligand
BDBM87299
Substrate
Meas. Tech.
Luminescence-based cell-based high throughput dose response assay for inhibitors of the Steroid Receptor Coactivator 3 (SRC3; NCOA3)
IC50
>35879±n/a nM
Citation
 PubChem, PC Luminescence-based cell-based high throughput dose response assay for inhibitors of the Steroid Receptor Coactivator 3 (SRC3; NCOA3) PubChem Bioassay (2012)[AID] 
Target
Name:
Nuclear receptor coactivator 3
Synonyms:
AIB1 NCOA3 RAC3 nuclear receptor coactivator 3 isoform a
Type:
Enzyme Catalytic Domain
Mol. Mass.:
155305.29
Organism:
Homo sapiens (Human)
Description:
Q9Y6Q9
Residue:
1424
  
Inhibitor
Name:
BDBM87299
Synonyms:
MLS000703938 N-(2,3-dihydro-1,4-benzodioxin-6-yl)-2-[4-[2-(2,3-dihydro-1,4-benzodioxin-6-ylamino)-2-oxidanylidene-ethyl]-1,1-bis(oxidanylidene)thiolan-3-yl]ethanamide N-(2,3-dihydro-1,4-benzodioxin-6-yl)-2-[4-[2-(2,3-dihydro-1,4-benzodioxin-6-ylamino)-2-oxoethyl]-1,1-dioxothiolan-3-yl]acetamide SMR000225242 | cid_5045424
Type:
Small organic molecule
Emp. Form.:
C24H26N2O8S
Mol. Mass.:
502.537
SMILES:
O=C(CC1CS(=O)(=O)CC1CC(=O)Nc1ccc2OCCOc2c1)Nc1ccc2OCCOc2c1
: