Target
Nuclear receptor coactivator 3
Ligand
BDBM63568
Substrate
Meas. Tech.
Luminescence-based cell-based high throughput dose response assay for inhibitors of the Steroid Receptor Coactivator 3 (SRC3; NCOA3)
IC50
>35871±n/a nM
Citation
 PubChem, PC Luminescence-based cell-based high throughput dose response assay for inhibitors of the Steroid Receptor Coactivator 3 (SRC3; NCOA3) PubChem Bioassay (2012)[AID] 
Target
Name:
Nuclear receptor coactivator 3
Synonyms:
AIB1 NCOA3 RAC3 nuclear receptor coactivator 3 isoform a
Type:
Enzyme Catalytic Domain
Mol. Mass.:
155305.29
Organism:
Homo sapiens (Human)
Description:
Q9Y6Q9
Residue:
1424
  
Inhibitor
Name:
BDBM63568
Synonyms:
2-({[2-(4-ethylphenyl)-5-methyl-1,3-oxazol-4-yl]methyl}thio)-N-(2-furylmethyl)acetamide 2-[[2-(4-ethylphenyl)-5-methyl-1,3-oxazol-4-yl]methylsulfanyl]-N-(furan-2-ylmethyl)ethanamide 2-[[2-(4-ethylphenyl)-5-methyl-oxazol-4-yl]methylthio]-N-(2-furfuryl)acetamide SMR000309382 | cid_16193680
Type:
Small organic molecule
Emp. Form.:
C20H22N2O3S
Mol. Mass.:
370.465
SMILES:
CCc1ccc(cc1)-c1nc(CSCC(=O)NCc2ccco2)c(C)o1
: