Target
Nuclear receptor coactivator 3
Ligand
BDBM87329
Substrate
Meas. Tech.
Luminescence-based cell-based high throughput dose response assay for inhibitors of the Steroid Receptor Coactivator 3 (SRC3; NCOA3)
IC50
15370±n/a nM
Citation
 PubChem, PC Luminescence-based cell-based high throughput dose response assay for inhibitors of the Steroid Receptor Coactivator 3 (SRC3; NCOA3) PubChem Bioassay (2012)[AID] 
Target
Name:
Nuclear receptor coactivator 3
Synonyms:
AIB1 NCOA3 RAC3 nuclear receptor coactivator 3 isoform a
Type:
Enzyme Catalytic Domain
Mol. Mass.:
155305.29
Organism:
Homo sapiens (Human)
Description:
Q9Y6Q9
Residue:
1424
  
Inhibitor
Name:
BDBM87329
Synonyms:
4-(1,3-benzothiazol-2-ylsulfanyl)-3-nitro-benzenesulfonamide 4-(1,3-benzothiazol-2-ylthio)-3-nitro-benzenesulfonamide 4-(1,3-benzothiazol-2-ylthio)-3-nitrobenzenesulfonamide SMR000455959 | cid_2807234
Type:
Small organic molecule
Emp. Form.:
C13H9N3O4S3
Mol. Mass.:
367.423
SMILES:
NS(=O)(=O)c1ccc(Sc2nc3ccccc3s2)c(c1)[N+]([O-])=O
: