Target
Tegument protein VP16
Ligand
BDBM67818
Substrate
Meas. Tech.
Counterscreen for inhibitors of the Steroid Receptor Coactivator 3 (SRC3; NCOA3)
IC50
13617±n/a nM
Citation
 PubChem, PC Counterscreen for inhibitors of the Steroid Receptor Coactivator 3 (SRC3; NCOA3): Luminescence-based cell-based high throughput dose response assay to identify inhibitors of the Herpes Virus Virion Protein 16 (VP16) PubChem Bioassay (2012)[AID] 
Target
Name:
Tegument protein VP16
Synonyms:
Alpha trans-inducing protein (VP16) transactivating tegument protein VP16
Type:
PROTEIN
Mol. Mass.:
54325.13
Organism:
Human herpesvirus 1 (strain 17) (HHV-1) (Human herpes simplex virus1)
Description:
EBI_100271
Residue:
490
  
Inhibitor
Name:
BDBM67818
Synonyms:
2-chloranyl-N-(3-quinoxalin-2-ylphenyl)ethanamide 2-chloro-N-[3-(2-quinoxalinyl)phenyl]acetamide SMR000126153 cid_1485433
Type:
Small organic molecule
Emp. Form.:
C16H12ClN3O
Mol. Mass.:
297.739
SMILES:
ClCC(=O)Nc1cccc(c1)-c1cnc2ccccc2n1
: