Target
Tegument protein VP16
Ligand
BDBM87320
Substrate
Meas. Tech.
Counterscreen for inhibitors of the Steroid Receptor Coactivator 3 (SRC3; NCOA3)
IC50
9662±n/a nM
Citation
 PubChem, PC Counterscreen for inhibitors of the Steroid Receptor Coactivator 3 (SRC3; NCOA3): Luminescence-based cell-based high throughput dose response assay to identify inhibitors of the Herpes Virus Virion Protein 16 (VP16) PubChem Bioassay (2012)[AID] 
Target
Name:
Tegument protein VP16
Synonyms:
Alpha trans-inducing protein (VP16) transactivating tegument protein VP16
Type:
PROTEIN
Mol. Mass.:
54325.13
Organism:
Human herpesvirus 1 (strain 17) (HHV-1) (Human herpes simplex virus1)
Description:
EBI_100271
Residue:
490
  
Inhibitor
Name:
BDBM87320
Synonyms:
(2S)-2-amino-N-[(E)-(4-keto-6-methyl-chromen-3-yl)methyleneamino]-3-phenyl-propionamide;hydrochloride (2S)-2-amino-N-[(E)-(6-methyl-4-oxochromen-3-yl)methylideneamino]-3-phenylpropanamide;hydrochloride (S)-2-Amino-3-phenyl-propionic acid [1-(6-methyl-4-oxo-4H-chromen-3-yl)-meth-(E)-ylidene]-hydrazide SMR000438045 | cid_52994974
Type:
Small organic molecule
Emp. Form.:
C20H19N3O3
Mol. Mass.:
349.3832
SMILES:
Cc1ccc2occ(\C=N\NC(=O)[C@@H](N)Cc3ccccc3)c(=O)c2c1
: