Target
Nuclear receptor coactivator 1
Ligand
BDBM87290
Substrate
Meas. Tech.
Counterscreen for inhibitors of the Steroid Receptor Coactivator 3 (SRC3; NCOA3)
IC50
>35869±n/a nM
Citation
 PubChem, PC Counterscreen for inhibitors of the Steroid Receptor Coactivator 3 (SRC3; NCOA3): Luminescence-based cell-based high throughput dose response assay to identify inhibitors of the Steroid Receptor Coactivator 1 (SRC1; NCOA1) PubChem Bioassay (2012)[AID] 
Target
Name:
Nuclear receptor coactivator 1
Synonyms:
BHLHE74 NCOA1 NCoA-1 Protein Hin-2 Renal carcinoma antigen NY-REN-52 SRC1 nuclear receptor coactivator 1 isoform 1
Type:
PROTEIN
Mol. Mass.:
156749.34
Organism:
Homo sapiens (Human)
Description:
ChEMBL_759690
Residue:
1441
  
Inhibitor
Name:
BDBM87290
Synonyms:
4-(dimethylamino)-N-phenyl-benzenecarbothioamide 4-(dimethylamino)-N-phenylbenzenecarbothioamide SMR000270190 | cid_805690
Type:
Small organic molecule
Emp. Form.:
C15H16N2S
Mol. Mass.:
256.366
SMILES:
CN(C)c1ccc(cc1)C(=S)Nc1ccccc1
: