Target
Nuclear receptor coactivator 1
Ligand
BDBM87321
Substrate
Meas. Tech.
Counterscreen for inhibitors of the Steroid Receptor Coactivator 3 (SRC3; NCOA3)
IC50
17614±n/a nM
Citation
 PubChem, PC Counterscreen for inhibitors of the Steroid Receptor Coactivator 3 (SRC3; NCOA3): Luminescence-based cell-based high throughput dose response assay to identify inhibitors of the Steroid Receptor Coactivator 1 (SRC1; NCOA1) PubChem Bioassay (2012)[AID] 
Target
Name:
Nuclear receptor coactivator 1
Synonyms:
BHLHE74 NCOA1 NCoA-1 Protein Hin-2 Renal carcinoma antigen NY-REN-52 SRC1 nuclear receptor coactivator 1 isoform 1
Type:
PROTEIN
Mol. Mass.:
156749.34
Organism:
Homo sapiens (Human)
Description:
ChEMBL_759690
Residue:
1441
  
Inhibitor
Name:
BDBM87321
Synonyms:
3-Chloro-4-[4-(4-fluoro-benzenesulfonyl)-piperazin-1-yl]-N,N-dimethyl-benzenesulfonamide 3-chloro-4-[4-(4-fluorophenyl)sulfonyl-1-piperazinyl]-N,N-dimethylbenzenesulfonamide 3-chloro-4-[4-(4-fluorophenyl)sulfonylpiperazino]-N,N-dimethyl-benzenesulfonamide SMR000008025 | cid_652727
Type:
Small organic molecule
Emp. Form.:
C18H21ClFN3O4S2
Mol. Mass.:
461.958
SMILES:
CN(C)S(=O)(=O)c1ccc(N2CCN(CC2)S(=O)(=O)c2ccc(F)cc2)c(Cl)c1
: