Target
Nuclear receptor coactivator 1
Ligand
BDBM65618
Substrate
Meas. Tech.
Counterscreen for inhibitors of the Steroid Receptor Coactivator 3 (SRC3; NCOA3)
IC50
>35864±n/a nM
Citation
 PubChem, PC Counterscreen for inhibitors of the Steroid Receptor Coactivator 3 (SRC3; NCOA3): Luminescence-based cell-based high throughput dose response assay to identify inhibitors of the Steroid Receptor Coactivator 1 (SRC1; NCOA1) PubChem Bioassay (2012)[AID] 
Target
Name:
Nuclear receptor coactivator 1
Synonyms:
BHLHE74 NCOA1 NCoA-1 Protein Hin-2 Renal carcinoma antigen NY-REN-52 SRC1 nuclear receptor coactivator 1 isoform 1
Type:
PROTEIN
Mol. Mass.:
156749.34
Organism:
Homo sapiens (Human)
Description:
ChEMBL_759690
Residue:
1441
  
Inhibitor
Name:
BDBM65618
Synonyms:
(6E)-2-methoxy-6-[[(5-nitro-2-pyridinyl)hydrazo]methylidene]-1-cyclohexa-2,4-dienone (6E)-2-methoxy-6-[[N'-(5-nitro-2-pyridyl)hydrazino]methylene]cyclohexa-2,4-dien-1-one SMR000538788 | cid_5344602
Type:
Small organic molecule
Emp. Form.:
C13H12N4O4
Mol. Mass.:
288.2588
SMILES:
COc1ccc[c-](C[NH+]=Nc2ccc(cn2)[N+]([O-])=O)c1=O
: