Target
Nuclear receptor coactivator 1
Ligand
BDBM87348
Substrate
Meas. Tech.
Counterscreen for inhibitors of the Steroid Receptor Coactivator 3 (SRC3; NCOA3)
IC50
>35894±n/a nM
Citation
 PubChem, PC Counterscreen for inhibitors of the Steroid Receptor Coactivator 3 (SRC3; NCOA3): Luminescence-based cell-based high throughput dose response assay to identify inhibitors of the Steroid Receptor Coactivator 1 (SRC1; NCOA1) PubChem Bioassay (2012)[AID] 
Target
Name:
Nuclear receptor coactivator 1
Synonyms:
BHLHE74 NCOA1 NCoA-1 Protein Hin-2 Renal carcinoma antigen NY-REN-52 SRC1 nuclear receptor coactivator 1 isoform 1
Type:
PROTEIN
Mol. Mass.:
156749.34
Organism:
Homo sapiens (Human)
Description:
ChEMBL_759690
Residue:
1441
  
Inhibitor
Name:
BDBM87348
Synonyms:
2-bromanyl-N-[(E)-(6-methyl-4-oxidanylidene-chromen-3-yl)methylideneamino]benzamide 2-bromo-N-[(E)-(6-methyl-4-oxo-1-benzopyran-3-yl)methylideneamino]benzamide MLS001224642 cid_17374543
Type:
Small organic molecule
Emp. Form.:
C18H13BrN2O3
Mol. Mass.:
385.211
SMILES:
Cc1ccc2occ(\C=N\NC(=O)c3ccccc3Br)c(=O)c2c1
: