Target
Botulinum neurotoxin type A
Ligand
BDBM50876
Substrate
Meas. Tech.
High-throughput multiplex microsphere dose response for inhibitors of toxin protease, specifically Botulinum neurotoxin light chain A protease, compounds from Cherry Pick 01
EC50
>20000±n/a nM
Citation
 PubChem, PC High-throughput multiplex microsphere dose response for inhibitors of toxin protease, specifically Botulinum neurotoxin light chain A protease, compounds from Cherry Pick 01 PubChem Bioassay (2012)[AID] 
Target
Name:
Botulinum neurotoxin type A
Synonyms:
BXA1_CLOBH bna | botA
Type:
PROTEIN
Mol. Mass.:
149421.96
Organism:
Clostridium botulinum (strain Hall / ATCC 3502 / NCTC 13319 / Type A)
Description:
ChEMBL_987932
Residue:
1296
  
Inhibitor
Name:
BDBM50876
Synonyms:
(3Z)-3-phenacylidene-1-phenyl-4H-quinoxalin-2-one MLS000533709 cid_5658596
Type:
Small organic molecule
Emp. Form.:
C22H16N2O2
Mol. Mass.:
340.3746
SMILES:
O=C(Cc1nc2ccccc2n(-c2ccccc2)c1=O)c1ccccc1
: