Target
Botulinum neurotoxin type F
Ligand
BDBM72525
Substrate
Meas. Tech.
High-throughput multiplex microsphere dose response for inhibitors of toxin protease, specifically Botulinum neurotoxin light chain F protease, compounds from Cherry Pick 01
EC50
>20000±n/a nM
Citation
 PubChem, PC High-throughput multiplex microsphere dose response for inhibitors of toxin protease, specifically Botulinum neurotoxin light chain F protease, compounds from Cherry Pick 01 PubChem Bioassay (2012)[AID] 
Target
Name:
Botulinum neurotoxin type F
Synonyms:
BXF_CLOBO botulinum neurotoxin type F, BoNT/F
Type:
Enzyme Catalytic Domain
Mol. Mass.:
146691.56
Organism:
Clostridium botulinum Bf
Description:
P30996
Residue:
1274
  
Inhibitor
Name:
BDBM72525
Synonyms:
1-[2-[3-(3,4-dimethoxyphenyl)-5-thiophen-2-yl-3,4-dihydropyrazol-2-yl]-4-methyl-1,3-thiazol-5-yl]ethanone;hydrobromide 1-[2-[5-(3,4-dimethoxyphenyl)-3-(2-thienyl)-2-pyrazolin-1-yl]-4-methyl-thiazol-5-yl]ethanone;hydrobromide 1-{2-[5-(3,4-dimethoxyphenyl)-3-thien-2-yl-4,5-dihydro-1H-pyrazol-1-yl]-4-methyl-1,3-thiazol-5-yl}ethanone SMR000305720 | cid_16193282
Type:
Small organic molecule
Emp. Form.:
C21H21N3O3S2
Mol. Mass.:
427.54
SMILES:
COc1ccc(cc1OC)C1CC(=NN1c1nc(C)c(s1)C(C)=O)c1cccs1
: