Target
Lethal factor
Ligand
BDBM50876
Substrate
Meas. Tech.
High-throughput multiplex microsphere dose response for inhibitors of toxin protease, specifically Lethal Factor protease, compounds from Cherry Pick 01
EC50
>20000±n/a nM
Citation
 PubChem, PC High-throughput multiplex microsphere dose response for inhibitors of toxin protease, specifically Lethal Factor protease, compounds from Cherry Pick 01 PubChem Bioassay (2012)[AID] 
Target
Name:
Lethal factor
Synonyms:
Anthrax Lethal Factor (LF) Antrax lethal toxin lef | lethal factor
Type:
PROTEIN
Mol. Mass.:
93758.56
Organism:
Bacillus anthracis
Description:
ChEMBL_1460338
Residue:
809
  
Inhibitor
Name:
BDBM50876
Synonyms:
(3Z)-3-phenacylidene-1-phenyl-4H-quinoxalin-2-one MLS000533709 cid_5658596
Type:
Small organic molecule
Emp. Form.:
C22H16N2O2
Mol. Mass.:
340.3746
SMILES:
O=C(Cc1nc2ccccc2n(-c2ccccc2)c1=O)c1ccccc1
: