Target
Fibroblast growth factor receptor 3
Ligand
BDBM278486
Substrate
IC50
<100±n/a nM
Citation
 Sun, YLu, LYao, WHe, CZhang, F Bicyclic heterocycles as FGFR inhibitors US Patent  US10040790 Publication Date 8/7/2018 
Target
Name:
Fibroblast growth factor receptor 3
Synonyms:
CD_antigen: CD333 FGFR3 Fibroblast growth factor receptor JTK4
Type:
Protein
Mol. Mass.:
87699.57
Organism:
Homo sapiens (Human)
Description:
P22607
Residue:
806
  
Inhibitor
Name:
BDBM278486
Synonyms:
7-amino-3-(2,6-difluoro-3,5-dimethoxyphenyl)-8-ethyl-1-methyl-3,4-dihydropyrido[4,3-d]pyrimidin-2(1H)-one US10450313, Example 2 US11530214, Example 2
Type:
Small organic molecule
Emp. Form.:
C18H20F2N4O3
Mol. Mass.:
378.3732
SMILES:
CCc1c(N)ncc2CN(C(=O)N(C)c12)c1c(F)c(OC)cc(OC)c1F
: