Target
Fibroblast growth factor receptor 1
Ligand
BDBM278501
Substrate
Meas. Tech.
FGFR Enzymatic Assay
pH
7.5±n/a
IC50
<100±n/a nM
Comments
extracted
Citation
 Sun, YLu, LYao, WHe, CZhang, F Bicyclic heterocycles as FGFR inhibitors US Patent  US10040790 Publication Date 8/7/2018 
Target
Name:
Fibroblast growth factor receptor 1
Synonyms:
BFGFR Basic fibroblast growth factor receptor 1 (FGFR1) CEK FGFR-1 FGFR-1, (FL) FGFR1_HUMAN FLT2 Fibroblast growth factor receptor 1 (FGFR-1) Fms-like tyrosine kinase 2 N-sam bFGF-R | c-fgr
Type:
Receptor
Mol. Mass.:
91861.70
Organism:
Homo sapiens (Human)
Description:
P11362
Residue:
822
  
Inhibitor
Name:
BDBM278501
Synonyms:
7-amino-3-(2,6-difluoro-3,5-dimethoxyphenyl)-1-methyl-8-pyridin-4-yl-3,4-dihydropyrido[4,3-d]pyrimidin-2(1H)-one US10450313, Example 17 US11530214, Example 17
Type:
Small organic molecule
Emp. Form.:
C21H19F2N5O3
Mol. Mass.:
427.4041
SMILES:
COc1cc(OC)c(F)c(N2Cc3cnc(N)c(-c4ccncc4)c3N(C)C2=O)c1F
: