Target
Fibroblast growth factor receptor 2
Ligand
BDBM278513
Substrate
IC50
<100±n/a nM
Citation
 Sun, YLu, LYao, WHe, CZhang, F Bicyclic heterocycles as FGFR inhibitors US Patent  US10040790 Publication Date 8/7/2018 
Target
Name:
Fibroblast growth factor receptor 2
Synonyms:
BEK FGFR-2 FGFR2 Fibroblast growth factor receptor 2 (FGFR2) KGFR Keratinocyte growth factor receptor VEGF-receptor 2 and Fibroblast growth factor receptor 2
Type:
Enzyme
Mol. Mass.:
92015.45
Organism:
Homo sapiens (Human)
Description:
P21802
Residue:
821
  
Inhibitor
Name:
BDBM278513
Synonyms:
(S)-2'-(2,6-difluoro-3,5-dimethoxyphenyl)-6'-(tetrahydrofuran-3-ylamino)-1'H-spiro[cyclopropane-1,4'-[2,7]naphthyridin]-3'(2'H)-one US10450313, Example 29 US11530214, Example 29
Type:
Small organic molecule
Emp. Form.:
C22H23F2N3O4
Mol. Mass.:
431.4325
SMILES:
COc1cc(OC)c(F)c(N2Cc3cnc(NC4CCOC4)cc3C3(CC3)C2=O)c1F
: