Target
Fibroblast growth factor receptor 3
Ligand
BDBM278520
Substrate
IC50
<100±n/a nM
Citation
 Sun, YLu, LYao, WHe, CZhang, F Bicyclic heterocycles as FGFR inhibitors US Patent  US10040790 Publication Date 8/7/2018 
Target
Name:
Fibroblast growth factor receptor 3
Synonyms:
CD_antigen: CD333 FGFR3 Fibroblast growth factor receptor JTK4
Type:
Protein
Mol. Mass.:
87699.57
Organism:
Homo sapiens (Human)
Description:
P22607
Residue:
806
  
Inhibitor
Name:
BDBM278520
Synonyms:
2'-(2,6-difluoro-3,5-dimethoxyphenyl)-6'-(1-methyl-1H-pyrazol-4-ylamino)-1'H-spiro[cyclopropane-1,4'-[2,7]naphthyridin]-3'(2'H)-one US10450313, Example 36 US11530214, Example 36
Type:
Small organic molecule
Emp. Form.:
C22H21F2N5O3
Mol. Mass.:
441.4306
SMILES:
COc1cc(OC)c(F)c(N2Cc3cnc(Nc4cnn(C)c4)cc3C3(CC3)C2=O)c1F
: