Target
Fibroblast growth factor receptor 1
Ligand
BDBM278521
Substrate
Meas. Tech.
FGFR Enzymatic Assay
pH
7.5±n/a
IC50
<100±n/a nM
Comments
extracted
Citation
 Sun, YLu, LYao, WHe, CZhang, F Bicyclic heterocycles as FGFR inhibitors US Patent  US10040790 Publication Date 8/7/2018 
Target
Name:
Fibroblast growth factor receptor 1
Synonyms:
BFGFR Basic fibroblast growth factor receptor 1 (FGFR1) CEK FGFR-1 FGFR-1, (FL) FGFR1_HUMAN FLT2 Fibroblast growth factor receptor 1 (FGFR-1) Fms-like tyrosine kinase 2 N-sam bFGF-R | c-fgr
Type:
Receptor
Mol. Mass.:
91861.70
Organism:
Homo sapiens (Human)
Description:
P11362
Residue:
822
  
Inhibitor
Name:
BDBM278521
Synonyms:
2'-(2,6-difluoro-3,5-dimethoxyphenyl)-6'-((1-methyl-1H-pyrazol-4-yl)methylamino)-1'H-spiro[cyclopropane-1,4'-[2,7]naphthyridin]-3'(2'H)-one US10947230, Example 37 | US11530214, Example 37
Type:
Small organic molecule
Emp. Form.:
C23H23F2N5O3
Mol. Mass.:
455.4572
SMILES:
COc1cc(OC)c(F)c(N2Cc3cnc(NCc4cnn(C)c4)cc3C3(CC3)C2=O)c1F
: