Target
Fibroblast growth factor receptor 1
Ligand
BDBM278534
Substrate
Meas. Tech.
FGFR Enzymatic Assay
pH
7.5±n/a
IC50
<100±n/a nM
Comments
extracted
Citation
 Sun, YLu, LYao, WHe, CZhang, F Bicyclic heterocycles as FGFR inhibitors US Patent  US10040790 Publication Date 8/7/2018 
Target
Name:
Fibroblast growth factor receptor 1
Synonyms:
BFGFR Basic fibroblast growth factor receptor 1 (FGFR1) CEK FGFR-1 FGFR-1, (FL) FGFR1_HUMAN FLT2 Fibroblast growth factor receptor 1 (FGFR-1) Fms-like tyrosine kinase 2 N-sam bFGF-R | c-fgr
Type:
Receptor
Mol. Mass.:
91861.70
Organism:
Homo sapiens (Human)
Description:
P11362
Residue:
822
  
Inhibitor
Name:
BDBM278534
Synonyms:
7-amino-1-cyclopentyl-3-(2,6-difluoro-3,5-dimethoxyphenyl)-2-oxo-1,2,3,4-tetrahydropyrido[4,3-d]pyrimidine-8-carbonitrile US10450313, Example 50 US11530214, Example 50
Type:
Small organic molecule
Emp. Form.:
C21H21F2N5O3
Mol. Mass.:
429.4199
SMILES:
COc1cc(OC)c(F)c(N2Cc3cnc(N)c(C#N)c3N(C3CCCC3)C2=O)c1F
: