Target
Tyrosine-protein kinase ABL1
Ligand
BDBM87437
Substrate
Meas. Tech.
TRFRET-based biochemical high throughput dose response assay for inhibitors of the interaction of the Ras and Rab interactor 1 protein (Rin1) and the c-abl oncogene 1
IC50
11849±n/a nM
Citation
 PubChem, PC TRFRET-based biochemical high throughput dose response assay for inhibitors of the interaction of the Ras and Rab interactor 1 protein (Rin1) and the c-abl oncogene 1, non-receptor tyrosine kinase (Abl) PubChem Bioassay (2012)[AID] 
Target
Name:
Tyrosine-protein kinase ABL1
Synonyms:
ABL ABL1_HUMAN JTK7 Proto-oncogene tyrosine-protein kinase ABL1 Tyrosine-protein kinase ABL V-abl Abelson murine leukemia viral oncogene homolog 1 p150 | tyrosine-protein kinase ABL1 isoform a
Type:
Enzyme
Mol. Mass.:
122897.30
Organism:
Homo sapiens (Human)
Description:
P00519
Residue:
1130
  
Inhibitor
Name:
BDBM87437
Synonyms:
4-({[4-(4-bromophenyl)-5-(3-pyridinyl)-4H-1,2,4-triazol-3-yl]thio}methyl)benzoic acid 4-[[[4-(4-bromophenyl)-5-(3-pyridinyl)-1,2,4-triazol-3-yl]thio]methyl]benzoic acid MLS000693296 cid_1242321
Type:
Small organic molecule
Emp. Form.:
C21H15BrN4O2S
Mol. Mass.:
467.338
SMILES:
OC(=O)c1ccc(CSc2nnc(-c3cccnc3)n2-c2ccc(Br)cc2)cc1
: