Target
Tyrosine-protein kinase ABL1
Ligand
BDBM87464
Substrate
Meas. Tech.
TRFRET-based biochemical high throughput dose response assay for inhibitors of the interaction of the Ras and Rab interactor 1 protein (Rin1) and the c-abl oncogene 1
IC50
>73403±n/a nM
Citation
 PubChem, PC TRFRET-based biochemical high throughput dose response assay for inhibitors of the interaction of the Ras and Rab interactor 1 protein (Rin1) and the c-abl oncogene 1, non-receptor tyrosine kinase (Abl) PubChem Bioassay (2012)[AID] 
Target
Name:
Tyrosine-protein kinase ABL1
Synonyms:
ABL ABL1_HUMAN JTK7 Proto-oncogene tyrosine-protein kinase ABL1 Tyrosine-protein kinase ABL V-abl Abelson murine leukemia viral oncogene homolog 1 p150 | tyrosine-protein kinase ABL1 isoform a
Type:
Enzyme
Mol. Mass.:
122897.30
Organism:
Homo sapiens (Human)
Description:
P00519
Residue:
1130
  
Inhibitor
Name:
BDBM87464
Synonyms:
2-(2-Benzyl-quinazolin-4-ylsulfanyl)-N,N-diethyl-acetamide 2-[(2-benzylquinazolin-4-yl)thio]-N,N-diethyl-acetamide N,N-diethyl-2-[2-(phenylmethyl)quinazolin-4-yl]sulfanyl-ethanamide SMR000503897 | cid_1442486
Type:
Small organic molecule
Emp. Form.:
C21H23N3OS
Mol. Mass.:
365.492
SMILES:
CCN(CC)C(=O)CSc1nc(Cc2ccccc2)nc2ccccc12
: