Target
Tyrosine-protein kinase ABL1
Ligand
BDBM87467
Substrate
Meas. Tech.
TRFRET-based biochemical high throughput dose response assay for inhibitors of the interaction of the Ras and Rab interactor 1 protein (Rin1) and the c-abl oncogene 1
IC50
>73453±n/a nM
Citation
 PubChem, PC TRFRET-based biochemical high throughput dose response assay for inhibitors of the interaction of the Ras and Rab interactor 1 protein (Rin1) and the c-abl oncogene 1, non-receptor tyrosine kinase (Abl) PubChem Bioassay (2012)[AID] 
Target
Name:
Tyrosine-protein kinase ABL1
Synonyms:
ABL ABL1_HUMAN JTK7 Proto-oncogene tyrosine-protein kinase ABL1 Tyrosine-protein kinase ABL V-abl Abelson murine leukemia viral oncogene homolog 1 p150 | tyrosine-protein kinase ABL1 isoform a
Type:
Enzyme
Mol. Mass.:
122897.30
Organism:
Homo sapiens (Human)
Description:
P00519
Residue:
1130
  
Inhibitor
Name:
BDBM87467
Synonyms:
6-[(2E)-2-(phenylmethylene)hydrazinyl]-1H-pyrimidin-2-one 6-[(2E)-2-benzylidenehydrazinyl]-1H-pyrimidin-2-one MLS001165410 cid_9701750
Type:
Small organic molecule
Emp. Form.:
C11H10N4O
Mol. Mass.:
214.2233
SMILES:
O=c1nccc(N=NCc2ccccc2)[nH]1
: