Target
Tyrosine-protein kinase ABL1
Ligand
BDBM87470
Substrate
Meas. Tech.
TRFRET-based biochemical high throughput dose response assay for inhibitors of the interaction of the Ras and Rab interactor 1 protein (Rin1) and the c-abl oncogene 1
IC50
9817±n/a nM
Citation
 PubChem, PC TRFRET-based biochemical high throughput dose response assay for inhibitors of the interaction of the Ras and Rab interactor 1 protein (Rin1) and the c-abl oncogene 1, non-receptor tyrosine kinase (Abl) PubChem Bioassay (2012)[AID] 
Target
Name:
Tyrosine-protein kinase ABL1
Synonyms:
ABL ABL1_HUMAN JTK7 Proto-oncogene tyrosine-protein kinase ABL1 Tyrosine-protein kinase ABL V-abl Abelson murine leukemia viral oncogene homolog 1 p150 | tyrosine-protein kinase ABL1 isoform a
Type:
Enzyme
Mol. Mass.:
122897.30
Organism:
Homo sapiens (Human)
Description:
P00519
Residue:
1130
  
Inhibitor
Name:
BDBM87470
Synonyms:
MLS001124414 N-[2-(3,4-diethoxyphenyl)ethyl]-2-(8-methyl-5-oxidanylidene-pyrido[2,3-b][1,5]benzoxazepin-6-yl)ethanamide N-[2-(3,4-diethoxyphenyl)ethyl]-2-(8-methyl-5-oxopyrido[2,3-b][1,5]benzoxazepin-6-yl)acetamide cid_16021192
Type:
Small organic molecule
Emp. Form.:
C27H29N3O5
Mol. Mass.:
475.5363
SMILES:
CCOc1ccc(CCNC(=O)CN2c3cc(C)ccc3Oc3ncccc3C2=O)cc1OCC
: