Target
Tyrosine-protein kinase ABL1
Ligand
BDBM87511
Substrate
Meas. Tech.
TRFRET-based biochemical high throughput dose response assay for inhibitors of the interaction of the Ras and Rab interactor 1 protein (Rin1) and the c-abl oncogene 1
IC50
12921±n/a nM
Citation
 PubChem, PC TRFRET-based biochemical high throughput dose response assay for inhibitors of the interaction of the Ras and Rab interactor 1 protein (Rin1) and the c-abl oncogene 1, non-receptor tyrosine kinase (Abl) PubChem Bioassay (2012)[AID] 
Target
Name:
Tyrosine-protein kinase ABL1
Synonyms:
ABL ABL1_HUMAN JTK7 Proto-oncogene tyrosine-protein kinase ABL1 Tyrosine-protein kinase ABL V-abl Abelson murine leukemia viral oncogene homolog 1 p150 | tyrosine-protein kinase ABL1 isoform a
Type:
Enzyme
Mol. Mass.:
122897.30
Organism:
Homo sapiens (Human)
Description:
P00519
Residue:
1130
  
Inhibitor
Name:
BDBM87511
Synonyms:
MLS002608881 N-(1-adamantylmethyl)-2-[(1S,12bS)-1-[4-(cyclopropanecarbonyl)piperazine-1-carbonyl]-12b-ethyl-4-keto-9-methoxy-1,2,3,6,7,12-hexahydropyrido[2,1-a]-carbolin-3-yl]acetamide N-(1-adamantylmethyl)-2-[(1S,12bS)-1-[[4-[cyclopropyl(oxo)methyl]-1-piperazinyl]-oxomethyl]-12b-ethyl-9-methoxy-4-oxo-1,2,3,6,7,12-hexahydroindolo[2,3-a]quinolizin-3-yl]acetamide cid_44601815
Type:
Small organic molecule
Emp. Form.:
C40H53N5O5
Mol. Mass.:
683.8793
SMILES:
[H]C12CC3([H])CC([H])(C1)CC(CNC(=O)CC1C[C@H](C(=O)N4CCN(CC4)C(=O)C4CC4)[C@]4(CC)N(CCc5c4[nH]c4ccc(OC)cc54)C1=O)(C2)C3
: