Target
Tyrosine-protein kinase ABL1
Ligand
BDBM87512
Substrate
Meas. Tech.
TRFRET-based biochemical high throughput dose response assay for inhibitors of the interaction of the Ras and Rab interactor 1 protein (Rin1) and the c-abl oncogene 1
IC50
20145±n/a nM
Citation
 PubChem, PC TRFRET-based biochemical high throughput dose response assay for inhibitors of the interaction of the Ras and Rab interactor 1 protein (Rin1) and the c-abl oncogene 1, non-receptor tyrosine kinase (Abl) PubChem Bioassay (2012)[AID] 
Target
Name:
Tyrosine-protein kinase ABL1
Synonyms:
ABL ABL1_HUMAN JTK7 Proto-oncogene tyrosine-protein kinase ABL1 Tyrosine-protein kinase ABL V-abl Abelson murine leukemia viral oncogene homolog 1 p150 | tyrosine-protein kinase ABL1 isoform a
Type:
Enzyme
Mol. Mass.:
122897.30
Organism:
Homo sapiens (Human)
Description:
P00519
Residue:
1130
  
Inhibitor
Name:
BDBM87512
Synonyms:
2-[(1S,12bS)-12b-ethyl-1-[4-(2-furoyl)piperazine-1-carbonyl]-4-keto-9-methoxy-1,2,3,6,7,12-hexahydropyrido[2,1-a]-carbolin-3-yl]-N-[3-(trifluoromethyl)benzyl]acetamide 2-[(1S,12bS)-12b-ethyl-1-[4-(furan-2-ylcarbonyl)piperazin-1-yl]carbonyl-9-methoxy-4-oxidanylidene-1,2,3,6,7,12-hexahydroindolo[2,3-a]quinolizin-3-yl]-N-[[3-(trifluoromethyl)phenyl]methyl]ethanamide MLS002608894 cid_44601828
Type:
Small organic molecule
Emp. Form.:
C38H40F3N5O6
Mol. Mass.:
719.7493
SMILES:
CC[C@@]12[C@H](CC(CC(=O)NCc3cccc(c3)C(F)(F)F)C(=O)N1CCc1c2[nH]c2ccc(OC)cc12)C(=O)N1CCN(CC1)C(=O)c1ccco1
: