Target
Tyrosine-protein kinase ABL1
Ligand
BDBM87519
Substrate
Meas. Tech.
TRFRET-based biochemical high throughput dose response assay for inhibitors of the interaction of the Ras and Rab interactor 1 protein (Rin1) and the c-abl oncogene 1
IC50
1378±n/a nM
Citation
 PubChem, PC TRFRET-based biochemical high throughput dose response assay for inhibitors of the interaction of the Ras and Rab interactor 1 protein (Rin1) and the c-abl oncogene 1, non-receptor tyrosine kinase (Abl) PubChem Bioassay (2012)[AID] 
Target
Name:
Tyrosine-protein kinase ABL1
Synonyms:
ABL ABL1_HUMAN JTK7 Proto-oncogene tyrosine-protein kinase ABL1 Tyrosine-protein kinase ABL V-abl Abelson murine leukemia viral oncogene homolog 1 p150 | tyrosine-protein kinase ABL1 isoform a
Type:
Enzyme
Mol. Mass.:
122897.30
Organism:
Homo sapiens (Human)
Description:
P00519
Residue:
1130
  
Inhibitor
Name:
BDBM87519
Synonyms:
1-(cyclopentanecarbonyl)-N-[4-[2-[4-[methyl(2-phenylethyl)carbamoyl]anilino]-2-oxoethyl]phenyl]piperidine-4-carboxamide 1-[cyclopentyl(oxo)methyl]-N-[4-[2-[4-[[methyl(2-phenylethyl)amino]-oxomethyl]anilino]-2-oxoethyl]phenyl]-4-piperidinecarboxamide MLS002698627 cid_44825536
Type:
Small organic molecule
Emp. Form.:
C36H42N4O4
Mol. Mass.:
594.7431
SMILES:
CN(CCc1ccccc1)C(=O)c1ccc(NC(=O)Cc2ccc(NC(=O)C3CCN(CC3)C(=O)C3CCCC3)cc2)cc1
: