Target
Nuclear receptor coactivator 3
Ligand
BDBM87255
Substrate
Meas. Tech.
Counterscreen for inhibitors of the Steroid Receptor Coactivator 1 (SRC1; NCOA1)
IC50
1016±n/a nM
Citation
 PubChem, PC Counterscreen for inhibitors of the Steroid Receptor Coactivator 1 (SRC1; NCOA1): Luminescence-based cell-based high throughput dose response assay to identify inhibitors of the Steroid Receptor Coactivator 3 (SRC3; NCOA3) PubChem Bioassay (2012)[AID] 
Target
Name:
Nuclear receptor coactivator 3
Synonyms:
AIB1 NCOA3 RAC3 nuclear receptor coactivator 3 isoform a
Type:
Enzyme Catalytic Domain
Mol. Mass.:
155305.29
Organism:
Homo sapiens (Human)
Description:
Q9Y6Q9
Residue:
1424
  
Inhibitor
Name:
BDBM87255
Synonyms:
(5E)-1-allyl-5-[1-[(3,5-dimethoxybenzyl)amino]ethylidene]barbituric acid MLS000041502 cid_5389663
Type:
Small organic molecule
Emp. Form.:
C18H21N3O5
Mol. Mass.:
359.3764
SMILES:
COc1cc(CNC(C)=C2C(=O)NC(=O)N(CC=C)C2=O)cc(OC)c1
: