Target
Nuclear receptor coactivator 3
Ligand
BDBM79412
Substrate
Meas. Tech.
Counterscreen for inhibitors of the Steroid Receptor Coactivator 1 (SRC1; NCOA1)
IC50
5957±n/a nM
Citation
 PubChem, PC Counterscreen for inhibitors of the Steroid Receptor Coactivator 1 (SRC1; NCOA1): Luminescence-based cell-based high throughput dose response assay to identify inhibitors of the Steroid Receptor Coactivator 3 (SRC3; NCOA3) PubChem Bioassay (2012)[AID] 
Target
Name:
Nuclear receptor coactivator 3
Synonyms:
AIB1 NCOA3 RAC3 nuclear receptor coactivator 3 isoform a
Type:
Enzyme Catalytic Domain
Mol. Mass.:
155305.29
Organism:
Homo sapiens (Human)
Description:
Q9Y6Q9
Residue:
1424
  
Inhibitor
Name:
BDBM79412
Synonyms:
(2E,5E)-2,5-bis(3,4-dimethoxybenzylidene)cyclopentanone (2E,5E)-2,5-bis[(3,4-dimethoxyphenyl)methylidene]cyclopentan-1-one MLS000586404 cid_5714141
Type:
Small organic molecule
Emp. Form.:
C23H24O5
Mol. Mass.:
380.4337
SMILES:
COc1ccc(\C=C2/CC\C(=C/c3ccc(OC)c(OC)c3)C2=O)cc1OC
: