Target
Nuclear receptor coactivator 3
Ligand
BDBM87586
Substrate
Meas. Tech.
Counterscreen for inhibitors of the Steroid Receptor Coactivator 1 (SRC1; NCOA1)
IC50
7762±n/a nM
Citation
 PubChem, PC Counterscreen for inhibitors of the Steroid Receptor Coactivator 1 (SRC1; NCOA1): Luminescence-based cell-based high throughput dose response assay to identify inhibitors of the Steroid Receptor Coactivator 3 (SRC3; NCOA3) PubChem Bioassay (2012)[AID] 
Target
Name:
Nuclear receptor coactivator 3
Synonyms:
AIB1 NCOA3 RAC3 nuclear receptor coactivator 3 isoform a
Type:
Enzyme Catalytic Domain
Mol. Mass.:
155305.29
Organism:
Homo sapiens (Human)
Description:
Q9Y6Q9
Residue:
1424
  
Inhibitor
Name:
BDBM87586
Synonyms:
8-(4-Methoxy-phenoxy)-1,3,7-trimethyl-3,7-dihydro-purine-2,6-dione 8-(4-methoxyphenoxy)-1,3,7-trimethyl-xanthine MLS001206715 cid_915026
Type:
Small organic molecule
Emp. Form.:
C15H16N4O4
Mol. Mass.:
316.3119
SMILES:
COc1ccc(Oc2nc3n(C)c(=O)n(C)c(=O)c3n2C)cc1
: