Target
Nuclear receptor coactivator 1
Ligand
BDBM4726
Substrate
Meas. Tech.
Luminescence-based cell-based high throughput dose response assay for inhibitors of the Steroid Receptor Coactivator 1 (SRC1; NCOA1)
IC50
>35867±n/a nM
Citation
 PubChem, PC Luminescence-based cell-based high throughput dose response assay for inhibitors of the Steroid Receptor Coactivator 1 (SRC1; NCOA1) PubChem Bioassay (2012)[AID] 
Target
Name:
Nuclear receptor coactivator 1
Synonyms:
BHLHE74 NCOA1 NCoA-1 Protein Hin-2 Renal carcinoma antigen NY-REN-52 SRC1 nuclear receptor coactivator 1 isoform 1
Type:
PROTEIN
Mol. Mass.:
156749.34
Organism:
Homo sapiens (Human)
Description:
ChEMBL_759690
Residue:
1441
  
Inhibitor
Name:
BDBM4726
Synonyms:
cid_3145757
Type:
Emp. Form.:
C20H13F7N4O4S2
Mol. Mass.:
570.46
SMILES:
[O-][N+](=O)c1cc(NC(=O)CSc2nc(cc(n2)C(F)(F)F)-c2cccs2)cc(OCC(F)(F)C(F)F)c1
: