Target
Nuclear receptor coactivator 1
Ligand
BDBM87298
Substrate
Meas. Tech.
Luminescence-based cell-based high throughput dose response assay for inhibitors of the Steroid Receptor Coactivator 1 (SRC1; NCOA1)
IC50
>35876±n/a nM
Citation
 PubChem, PC Luminescence-based cell-based high throughput dose response assay for inhibitors of the Steroid Receptor Coactivator 1 (SRC1; NCOA1) PubChem Bioassay (2012)[AID] 
Target
Name:
Nuclear receptor coactivator 1
Synonyms:
BHLHE74 NCOA1 NCoA-1 Protein Hin-2 Renal carcinoma antigen NY-REN-52 SRC1 nuclear receptor coactivator 1 isoform 1
Type:
PROTEIN
Mol. Mass.:
156749.34
Organism:
Homo sapiens (Human)
Description:
ChEMBL_759690
Residue:
1441
  
Inhibitor
Name:
BDBM87298
Synonyms:
MLS000689901 N-(4-hydroxyphenyl)-4-[(5E)-5-[(4-methylphenyl)methylidene]-4-oxidanylidene-2-sulfanylidene-1,3-thiazolidin-3-yl]butanamide N-(4-hydroxyphenyl)-4-[(5E)-5-[(4-methylphenyl)methylidene]-4-oxo-2-sulfanylidene-3-thiazolidinyl]butanamide SMR000298592 | cid_1346846
Type:
Small organic molecule
Emp. Form.:
C21H20N2O3S2
Mol. Mass.:
412.525
SMILES:
Cc1ccc(\C=C2\SC(=S)N(CCCC(=O)Nc3ccc(O)cc3)C2=O)cc1
: