Target
Nuclear receptor coactivator 1
Ligand
BDBM72763
Substrate
Meas. Tech.
Luminescence-based cell-based high throughput dose response assay for inhibitors of the Steroid Receptor Coactivator 1 (SRC1; NCOA1)
IC50
>35873±n/a nM
Citation
 PubChem, PC Luminescence-based cell-based high throughput dose response assay for inhibitors of the Steroid Receptor Coactivator 1 (SRC1; NCOA1) PubChem Bioassay (2012)[AID] 
Target
Name:
Nuclear receptor coactivator 1
Synonyms:
BHLHE74 NCOA1 NCoA-1 Protein Hin-2 Renal carcinoma antigen NY-REN-52 SRC1 nuclear receptor coactivator 1 isoform 1
Type:
PROTEIN
Mol. Mass.:
156749.34
Organism:
Homo sapiens (Human)
Description:
ChEMBL_759690
Residue:
1441
  
Inhibitor
Name:
BDBM72763
Synonyms:
2-[(5-phenyl-[1,2,4]triazolo[1,5-a]pyrimidin-7-yl)thio]acetic acid ethyl ester SMR000458640 ethyl 2-[(5-phenyl-[1,2,4]triazolo[1,5-a]pyrimidin-7-yl)sulfanyl]acetate ethyl 2-[(5-phenyl[1,2,4]triazolo[1,5-a]pyrimidin-7-yl)sulfanyl]acetate
Type:
Small organic molecule
Emp. Form.:
C15H14N4O2S
Mol. Mass.:
314.362
SMILES:
CCOC(=O)CSc1cc(nc2ncnn12)-c1ccccc1
: