Target
Polyadenylate-binding protein 1
Ligand
BDBM48305
Substrate
Meas. Tech.
Dose-response confirmation of microRNA-mediated mRNA deadenylation inhibitors by fluoresence polarization assay
IC50
>66000±n/a nM
Citation
 PubChem, PC Dose-response confirmation of microRNA-mediated mRNA deadenylation inhibitors by fluoresence polarization assay PubChem Bioassay (2012)[AID] 
Target
Name:
Polyadenylate-binding protein 1
Synonyms:
PAB1 PABP1 PABPC1 poly(A) binding protein, cytoplasmic 1 | polyadenylate-binding protein 1
Type:
Enzyme Catalytic Domain
Mol. Mass.:
70694.26
Organism:
Homo sapiens (Human)
Description:
gi_46367787
Residue:
636
  
Inhibitor
Name:
BDBM48305
Synonyms:
4-Methyl-N-(4-oxo-4H-benzo[d][1,3]thiazin-2-yl)-benzamide 4-methyl-N-(4-oxo-3,1-benzothiazin-2-yl)benzamide N-(4-keto-3,1-benzothiazin-2-yl)-4-methyl-benzamide cid_648853
Type:
Small organic molecule
Emp. Form.:
C16H12N2O2S
Mol. Mass.:
296.344
SMILES:
Cc1ccc(cc1)C(=O)Nc1nc2ccccc2c(=O)s1
: