Target
Polyadenylate-binding protein 1
Ligand
BDBM50776
Substrate
Meas. Tech.
Dose-response confirmation of microRNA-mediated mRNA deadenylation inhibitors by fluoresence polarization assay
IC50
35100±n/a nM
Citation
 PubChem, PC Dose-response confirmation of microRNA-mediated mRNA deadenylation inhibitors by fluoresence polarization assay PubChem Bioassay (2012)[AID] 
Target
Name:
Polyadenylate-binding protein 1
Synonyms:
PAB1 PABP1 PABPC1 poly(A) binding protein, cytoplasmic 1 | polyadenylate-binding protein 1
Type:
Enzyme Catalytic Domain
Mol. Mass.:
70694.26
Organism:
Homo sapiens (Human)
Description:
gi_46367787
Residue:
636
  
Inhibitor
Name:
BDBM50776
Synonyms:
6-chloranyl-3-methyl-1H-imidazo[4,5-b]pyridin-2-one MLS000079417 cid_657849
Type:
Small organic molecule
Emp. Form.:
C7H6ClN3O
Mol. Mass.:
183.595
SMILES:
Cn1c2ncc(Cl)cc2[nH]c1=O
: